Target
Nitric oxide synthase, brain
Ligand
BDBM50312521
Substrate
Meas. Tech.
ChEMBL_619387 (CHEMBL1104145)
Ki
80±n/a nM
Citation
 Xue, FFang, JLewis, WWMartásek, PRoman, LJSilverman, RB Potent and selective neuronal nitric oxide synthase inhibitors with improved cellular permeability. Bioorg Med Chem Lett 20:554-7 (2010)  
Target
Name:
Nitric oxide synthase, brain
Synonyms:
Bnos NC-NOS NOS type I nNOS Neuronal nitric oxide synthase Nitric Oxide Synthase, brain Nitric oxide synthase, brain (nNOS) Nitric-oxide synthase, brain (nNOS) Nos1 | Peptidyl-cysteine S-nitrosylase NOS1
Type:
Enzyme
Mol. Mass.:
160570.98
Organism:
Rattus norvegicus (rat)
Description:
Recombinant nNOS overexpressed in E. coli was used in enzyme assays.
Residue:
1429
  
Inhibitor
Name:
BDBM50312521
Synonyms:
6-(((3S,4S)/(3R,4R)-4-(2-(2,2-Difluoro-2-(3-fluorophenyl)ethylamino)ethoxy)pyrrolidin-3-yl)methyl)-4-methylpyridin-2-amine | CHEMBL1086859
Type:
Small organic molecule
Emp. Form.:
C21H27F3N4O
Mol. Mass.:
408.4605
SMILES:
Cc1cc(N)nc(CC2CNCC2OCCNCC(F)(F)c2cccc(F)c2)c1
: