Target
5-hydroxytryptamine receptor 2A
Ligand
BDBM50313250
Substrate
Meas. Tech.
ChEMBL_617080 (CHEMBL1100586)
IC50
92±n/a nM
Citation
 Kang, SYPark, EJPark, WKKim, HJJeong, DJung, MESong, KSLee, SHSeo, HJKim, MJLee, MHan, HKSon, EJPae, ANKim, JLee, J Arylpiperazine-containing pyrrole 3-carboxamide derivatives targeting serotonin 5-HT(2A), 5-HT(2C), and the serotonin transporter as a potential antidepressant. Bioorg Med Chem Lett 20:1705-11 (2010)  
Target
Name:
5-hydroxytryptamine receptor 2A
Synonyms:
5-HT-2 5-HT2A 5-hydroxytryptamine receptor 2A (5HT-2A) 5HT2A_HUMAN HTR2A | Serotonin receptor 2A
Type:
undefined
Mol. Mass.:
52607.65
Organism:
Homo sapiens (Human)
Description:
P28223
Residue:
471
  
Inhibitor
Name:
BDBM50313250
Synonyms:
CHEMBL1080726 | N-(3-(4-(3-chlorophenyl)piperazin-1-yl)propyl)-1,2-dimethyl-5-phenyl-1H-pyrrole-3-carboxamide
Type:
Small organic molecule
Emp. Form.:
C26H31ClN4O
Mol. Mass.:
451.004
SMILES:
Cc1c(cc(-c2ccccc2)n1C)C(=O)NCCCN1CCN(CC1)c1cccc(Cl)c1
: