Target
Sodium-dependent serotonin transporter
Ligand
BDBM50313255
Substrate
Meas. Tech.
ChEMBL_617082 (CHEMBL1100588)
IC50
80.2±n/a nM
Citation
 Kang, SYPark, EJPark, WKKim, HJJeong, DJung, MESong, KSLee, SHSeo, HJKim, MJLee, MHan, HKSon, EJPae, ANKim, JLee, J Arylpiperazine-containing pyrrole 3-carboxamide derivatives targeting serotonin 5-HT(2A), 5-HT(2C), and the serotonin transporter as a potential antidepressant. Bioorg Med Chem Lett 20:1705-11 (2010)  
Target
Name:
Sodium-dependent serotonin transporter
Synonyms:
5-HT Transporter 5HTT SC6A4_HUMAN SLC6A4 Serotonin transporter (5HTT) Sodium-dependent serotonin transporter (SERT) | Solute carrier family 6 member 4
Type:
Multi-pass membrane protein
Mol. Mass.:
70322.51
Organism:
Homo sapiens (Human)
Description:
P31645
Residue:
630
  
Inhibitor
Name:
BDBM50313255
Synonyms:
CHEMBL1080747 | N-(3-(4-(3-chlorophenyl)piperazin-1-yl)propyl)-1-(4-fluorophenyl)-2-methyl-5-phenyl-1H-pyrrole-3-carboxamide
Type:
Small organic molecule
Emp. Form.:
C31H32ClFN4O
Mol. Mass.:
531.063
SMILES:
Cc1c(cc(-c2ccccc2)n1-c1ccc(F)cc1)C(=O)NCCCN1CCN(CC1)c1cccc(Cl)c1
: