Target
Sodium-dependent serotonin transporter
Ligand
BDBM50313258
Substrate
Meas. Tech.
ChEMBL_617082 (CHEMBL1100588)
IC50
77±n/a nM
Citation
 Kang, SYPark, EJPark, WKKim, HJJeong, DJung, MESong, KSLee, SHSeo, HJKim, MJLee, MHan, HKSon, EJPae, ANKim, JLee, J Arylpiperazine-containing pyrrole 3-carboxamide derivatives targeting serotonin 5-HT(2A), 5-HT(2C), and the serotonin transporter as a potential antidepressant. Bioorg Med Chem Lett 20:1705-11 (2010)  
Target
Name:
Sodium-dependent serotonin transporter
Synonyms:
5-HT Transporter 5HTT SC6A4_HUMAN SLC6A4 Serotonin transporter (5HTT) Sodium-dependent serotonin transporter (SERT) | Solute carrier family 6 member 4
Type:
Multi-pass membrane protein
Mol. Mass.:
70322.51
Organism:
Homo sapiens (Human)
Description:
P31645
Residue:
630
  
Inhibitor
Name:
BDBM50313258
Synonyms:
CHEMBL1081468 | N-(3-(4-(2,3-Dimethylphenyl)piperazin-1-yl)propyl)-2-methyl-5-phenyl-1H-pyrrole-3-carboxamide
Type:
Small organic molecule
Emp. Form.:
C27H34N4O
Mol. Mass.:
430.5851
SMILES:
Cc1[nH]c(cc1C(=O)NCCCN1CCN(CC1)c1cccc(C)c1C)-c1ccccc1
: