Target
Sodium-dependent serotonin transporter
Ligand
BDBM50313263
Substrate
Meas. Tech.
ChEMBL_617082 (CHEMBL1100588)
IC50
92±n/a nM
Citation
 Kang, SYPark, EJPark, WKKim, HJJeong, DJung, MESong, KSLee, SHSeo, HJKim, MJLee, MHan, HKSon, EJPae, ANKim, JLee, J Arylpiperazine-containing pyrrole 3-carboxamide derivatives targeting serotonin 5-HT(2A), 5-HT(2C), and the serotonin transporter as a potential antidepressant. Bioorg Med Chem Lett 20:1705-11 (2010)  
Target
Name:
Sodium-dependent serotonin transporter
Synonyms:
5-HT Transporter 5HTT SC6A4_HUMAN SLC6A4 Serotonin transporter (5HTT) Sodium-dependent serotonin transporter (SERT) | Solute carrier family 6 member 4
Type:
Multi-pass membrane protein
Mol. Mass.:
70322.51
Organism:
Homo sapiens (Human)
Description:
P31645
Residue:
630
  
Inhibitor
Name:
BDBM50313263
Synonyms:
CHEMBL1088165 | N-(3-(4-(2,3-dimethylphenyl)piperazin-1-yl)propyl)-2-methyl-5-phenyl-1-(piperidin-1-yl)-1H-pyrrole-3-carboxamide
Type:
Small organic molecule
Emp. Form.:
C32H43N5O
Mol. Mass.:
513.7167
SMILES:
Cc1c(cc(-c2ccccc2)n1N1CCCCC1)C(=O)NCCCN1CCN(CC1)c1cccc(C)c1C
: