Target
5-hydroxytryptamine receptor 2C
Ligand
BDBM50313275
Substrate
Meas. Tech.
ChEMBL_617081 (CHEMBL1100587)
IC50
37±n/a nM
Citation
 Kang, SYPark, EJPark, WKKim, HJJeong, DJung, MESong, KSLee, SHSeo, HJKim, MJLee, MHan, HKSon, EJPae, ANKim, JLee, J Arylpiperazine-containing pyrrole 3-carboxamide derivatives targeting serotonin 5-HT(2A), 5-HT(2C), and the serotonin transporter as a potential antidepressant. Bioorg Med Chem Lett 20:1705-11 (2010)  
Target
Name:
5-hydroxytryptamine receptor 2C
Synonyms:
5-HT-1C 5-HT1C 5-HT2C-INI 5-HTR2C 5-hydroxytryptamine receptor 2C (5-HT-2C) 5HT-1C HTR1C Serotonin (5-HT3) receptor Serotonin Receptor 2C
Type:
G Protein-Coupled Receptor (GPCR)
Mol. Mass.:
51836.79
Organism:
Homo sapiens (Human)
Description:
P28335
Residue:
458
  
Inhibitor
Name:
BDBM50313275
Synonyms:
CHEMBL1080522 | N-(2-(4-(2,3-dichlorophenyl)piperazin-1-yl)ethyl)-2-methyl-5-phenyl-1H-pyrrole-3-carboxamide
Type:
Small organic molecule
Emp. Form.:
C24H26Cl2N4O
Mol. Mass.:
457.395
SMILES:
Cc1[nH]c(cc1C(=O)NCCN1CCN(CC1)c1cccc(Cl)c1Cl)-c1ccccc1
: