Target
Sodium-dependent serotonin transporter
Ligand
BDBM50313276
Substrate
Meas. Tech.
ChEMBL_617082 (CHEMBL1100588)
IC50
57±n/a nM
Citation
 Kang, SYPark, EJPark, WKKim, HJJeong, DJung, MESong, KSLee, SHSeo, HJKim, MJLee, MHan, HKSon, EJPae, ANKim, JLee, J Arylpiperazine-containing pyrrole 3-carboxamide derivatives targeting serotonin 5-HT(2A), 5-HT(2C), and the serotonin transporter as a potential antidepressant. Bioorg Med Chem Lett 20:1705-11 (2010)  
Target
Name:
Sodium-dependent serotonin transporter
Synonyms:
5-HT Transporter 5HTT SC6A4_HUMAN SLC6A4 Serotonin transporter (5HTT) Sodium-dependent serotonin transporter (SERT) | Solute carrier family 6 member 4
Type:
Multi-pass membrane protein
Mol. Mass.:
70322.51
Organism:
Homo sapiens (Human)
Description:
P31645
Residue:
630
  
Inhibitor
Name:
BDBM50313276
Synonyms:
CHEMBL1080683 N-(2-(4-(2,3-dichlorophenyl)piperazin-1-yl)ethyl)-1,2-dimethyl-5-phenyl-1H-pyrrole-3-carboxamide
Type:
Small organic molecule
Emp. Form.:
C25H28Cl2N4O
Mol. Mass.:
471.422
SMILES:
Cc1c(cc(-c2ccccc2)n1C)C(=O)NCCN1CCN(CC1)c1cccc(Cl)c1Cl
: