Target
5-hydroxytryptamine receptor 1A
Ligand
BDBM50313267
Substrate
Meas. Tech.
ChEMBL_617087 (CHEMBL1101345)
IC50
117±n/a nM
Citation
 Kang, SYPark, EJPark, WKKim, HJJeong, DJung, MESong, KSLee, SHSeo, HJKim, MJLee, MHan, HKSon, EJPae, ANKim, JLee, J Arylpiperazine-containing pyrrole 3-carboxamide derivatives targeting serotonin 5-HT(2A), 5-HT(2C), and the serotonin transporter as a potential antidepressant. Bioorg Med Chem Lett 20:1705-11 (2010)  
Target
Name:
5-hydroxytryptamine receptor 1A
Synonyms:
5-HT-1A 5-hydroxytryptamine receptor 1A (5-HT-1A) ADRB2RL1 Dopamine D2 receptor and serotonin 1a receptor HTR1A | Serotonin receptor 1A
Type:
Mol. Mass.:
46122.49
Organism:
Homo sapiens (Human)
Description:
Residue:
422
  
Inhibitor
Name:
BDBM50313267
Synonyms:
CHEMBL1086626 | N-(3-(4-(2,3-Dichlorophenyl)piperazin-1-yl)propyl)-2-methyl-5-phenyl-1H-pyrrole-3-carboxamide
Type:
Small organic molecule
Emp. Form.:
C25H28Cl2N4O
Mol. Mass.:
471.422
SMILES:
Cc1[nH]c(cc1C(=O)NCCCN1CCN(CC1)c1cccc(Cl)c1Cl)-c1ccccc1
: