Target
5-hydroxytryptamine receptor 7
Ligand
BDBM50313271
Substrate
Meas. Tech.
ChEMBL_617089 (CHEMBL1101347)
IC50
493±n/a nM
Citation
 Kang, SYPark, EJPark, WKKim, HJJeong, DJung, MESong, KSLee, SHSeo, HJKim, MJLee, MHan, HKSon, EJPae, ANKim, JLee, J Arylpiperazine-containing pyrrole 3-carboxamide derivatives targeting serotonin 5-HT(2A), 5-HT(2C), and the serotonin transporter as a potential antidepressant. Bioorg Med Chem Lett 20:1705-11 (2010)  
Target
Name:
5-hydroxytryptamine receptor 7
Synonyms:
5-HT-7 5-HT7 5-HT7S 5HT7 HTR7 | Serotonin receptor 7
Type:
G Protein-Coupled Receptor (GPCR)
Mol. Mass.:
53573.08
Organism:
Homo sapiens (Human)
Description:
P34969
Residue:
479
  
Inhibitor
Name:
BDBM50313271
Synonyms:
CHEMBL1088313 | N-(3-(4-(2,3-dichlorophenyl)piperazin-1-yl)propyl)-2-methyl-5-phenyl-1-(piperidin-1-yl)-1H-pyrrole-3-carboxamide
Type:
Small organic molecule
Emp. Form.:
C30H37Cl2N5O
Mol. Mass.:
554.554
SMILES:
Cc1c(cc(-c2ccccc2)n1N1CCCCC1)C(=O)NCCCN1CCN(CC1)c1cccc(Cl)c1Cl
: