Target
11-beta-hydroxysteroid dehydrogenase 1
Ligand
BDBM50313287
Substrate
Meas. Tech.
ChEMBL_617122 (CHEMBL1101380)
IC50
3.3±n/a nM
Citation
 Shah, UBoyle, CDChackalamannil, SBaker, HKowalski, TLee, JTerracina, GZhang, L Azabicyclic sulfonamides as potent 11beta-HSD1 inhibitors. Bioorg Med Chem Lett 20:1551-4 (2010)  
Target
Name:
11-beta-hydroxysteroid dehydrogenase 1
Synonyms:
11-DH 11-beta-Hydroxysteroid Dehydrogenase 1 (11-beta-HSD1) 11-beta-hydroxysteroid dehydrogenase 1 (11HSD1) Corticosteroid 11-beta-dehydrogenase isozyme 1 (11-beta-HSD-1) Corticosteroid 11-beta-dehydrogenase isozyme 1 (11beta-HSD1) HSD11 HSD11L | SDR26C1
Type:
Enzyme
Mol. Mass.:
32409.16
Organism:
Homo sapiens (Human)
Description:
P28845
Residue:
292
  
Inhibitor
Name:
BDBM50313287
Synonyms:
(1S,4S)-2-(4-ethylphenylsulfonyl)-5-methyl-2,5-diazabicyclo[2.2.1]heptane | CHEMBL1076580
Type:
Small organic molecule
Emp. Form.:
C14H20N2O2S
Mol. Mass.:
280.386
SMILES:
CCc1ccc(cc1)S(=O)(=O)N1C[C@@H]2C[C@H]1CN2C
: