Target
11-beta-hydroxysteroid dehydrogenase 1
Ligand
BDBM50313296
Substrate
Meas. Tech.
ChEMBL_617122 (CHEMBL1101380)
IC50
478±n/a nM
Citation
 Shah, UBoyle, CDChackalamannil, SBaker, HKowalski, TLee, JTerracina, GZhang, L Azabicyclic sulfonamides as potent 11beta-HSD1 inhibitors. Bioorg Med Chem Lett 20:1551-4 (2010)  
Target
Name:
11-beta-hydroxysteroid dehydrogenase 1
Synonyms:
11-DH 11-beta-Hydroxysteroid Dehydrogenase 1 (11-beta-HSD1) 11-beta-hydroxysteroid dehydrogenase 1 (11HSD1) Corticosteroid 11-beta-dehydrogenase isozyme 1 (11-beta-HSD-1) Corticosteroid 11-beta-dehydrogenase isozyme 1 (11beta-HSD1) HSD11 HSD11L | SDR26C1
Type:
Enzyme
Mol. Mass.:
32409.16
Organism:
Homo sapiens (Human)
Description:
P28845
Residue:
292
  
Inhibitor
Name:
BDBM50313296
Synonyms:
(1R,5S)-3-(4-tert-butylphenylsulfonyl)-8-methyl-3,8-diazabicyclo[3.2.1]octane | CHEMBL1081299
Type:
Small organic molecule
Emp. Form.:
C17H26N2O2S
Mol. Mass.:
322.466
SMILES:
CN1[C@H]2CC[C@@H]1CN(C2)S(=O)(=O)c1ccc(cc1)C(C)(C)C
: