Target
Beta-secretase 1
Ligand
BDBM50314604
Substrate
Meas. Tech.
ChEMBL_625146 (CHEMBL1115167)
IC50
50±n/a nM
Citation
 Zhou, PLi, YFan, YWang, ZChopra, ROlland, AHu, YMagolda, RLPangalos, MReinhart, PHTurner, MJBard, JMalamas, MSRobichaud, AJ Pyridinyl aminohydantoins as small molecule BACE1 inhibitors. Bioorg Med Chem Lett 20:2326-9 (2010)  
Target
Name:
Beta-secretase 1
Synonyms:
ASP2 Aspartyl protease 2 BACE1 Beta-secretase (BACE) Beta-secretase 1 (BACE 1) Beta-secretase 1 (BACE1) Beta-site amyloid precursor protein cleaving enzyme 1 Memapsin-2 beta-Secretase (BACE-1) | beta-Secretase (BACE1)
Type:
Protein
Mol. Mass.:
55755.10
Organism:
Homo sapiens (Human)
Description:
P56817
Residue:
501
  
Inhibitor
Name:
BDBM50314604
Synonyms:
(+/-)-2-amino-4-(2',5'-difluorobiphenyl-3-yl)-1-methyl-4-(pyridin-4-yl)-1H-imidazol-5(4H)-one | CHEMBL1092787
Type:
Small organic molecule
Emp. Form.:
C21H16F2N4O
Mol. Mass.:
378.3747
SMILES:
CN1C(N)=NC(C1=O)(c1ccncc1)c1cccc(c1)-c1cc(F)ccc1F
: