Target
5-hydroxytryptamine receptor 2C
Ligand
BDBM50314618
Substrate
Meas. Tech.
ChEMBL_625151 (CHEMBL1115172)
Ki
4±n/a nM
Citation
 Liu, KKLefker, BADombroski, MAChiang, PCornelius, PPatterson, TAZeng, YSantucci, STomlinson, EGibbons, CPMarala, RBrown, JAKong, JXLee, EWerner, WWenzel, ZGiragossian, CChen, HCoffey, SB Orally active and brain permeable proline amides as highly selective 5HT2c agonists for the treatment of obesity. Bioorg Med Chem Lett 20:2365-9 (2010)  
Target
Name:
5-hydroxytryptamine receptor 2C
Synonyms:
5-HT-1C 5-HT1C 5-HT2C-INI 5-HTR2C 5-hydroxytryptamine receptor 2C (5-HT-2C) 5HT-1C HTR1C Serotonin (5-HT3) receptor Serotonin Receptor 2C
Type:
G Protein-Coupled Receptor (GPCR)
Mol. Mass.:
51836.79
Organism:
Homo sapiens (Human)
Description:
P28335
Residue:
458
  
Inhibitor
Name:
BDBM50314618
Synonyms:
CHEMBL1090397 | N-((4'-chloro-3-fluorobiphenyl-4-yl)methyl)piperazine-1-carboxamide
Type:
Small organic molecule
Emp. Form.:
C18H19ClFN3O
Mol. Mass.:
347.814
SMILES:
Fc1cc(ccc1CNC(=O)N1CCNCC1)-c1ccc(Cl)cc1
: