Target
5-hydroxytryptamine receptor 6
Ligand
BDBM50314762
Substrate
Meas. Tech.
ChEMBL_626172 (CHEMBL1117029)
Ki
0.44±n/a nM
Citation
 Ivachtchenko, AVDmitriev, DEGolovina, ESDubrovskaya, ESKadieva, MGKoryakova, AGKysil, VMMitkin, ODTkachenko, SEOkun, IMVorobiov, AA Synthesis of cycloalkane-annelated 3-phenylsulfonyl-pyrazolo[1,5-a]pyrimidines and their evaluation as 5-HT6 receptor antagonists. Bioorg Med Chem Lett 20:2133-6 (2010)  
Target
Name:
5-hydroxytryptamine receptor 6
Synonyms:
5-HT-6 5-hydroxytryptamine receptor 6 (5-HT-6) 5-hydroxytryptamine receptor 6 (5HT6) HTR6 Serotonin 6 (5-HT6) receptor | Serotonin Receptor 6
Type:
G Protein-Coupled Receptor (GPCR)
Mol. Mass.:
46968.43
Organism:
Homo sapiens (Human)
Description:
P50406
Residue:
440
  
Inhibitor
Name:
BDBM50314762
Synonyms:
5-methyl-2-(methylthio)-3-(phenylsulfonyl)-6,7,8,9-tetrahydropyrazolo[1,5-a]quinazoline CHEMBL1091919 | US8629154, 1.2(3)
Type:
Small organic molecule
Emp. Form.:
C18H19N3O2S2
Mol. Mass.:
373.492
SMILES:
CSc1nn2c3CCCCc3c(C)nc2c1S(=O)(=O)c1ccccc1
: