Target
P2Y purinoceptor 1
Ligand
BDBM50118242
Substrate
Meas. Tech.
ChEMBL_626109 (CHEMBL1111635)
EC50
2.5±n/a nM
Citation
 Eliahu, SMartín-Gil, APerez de Lara, MJPintor, JCamden, JWeisman, GALecka, JSévigny, JFischer, B 2-MeS-beta,gamma-CCl2-ATP is a potent agent for reducing intraocular pressure. J Med Chem 53:3305-19 (2010)  
Target
Name:
P2Y purinoceptor 1
Synonyms:
P2RY1 | P2RY1_MELGA
Type:
Mol. Mass.:
41199.64
Organism:
Meleagris gallopavo
Description:
Residue:
362
  
Inhibitor
Name:
BDBM50118242
Synonyms:
((2R,3S,4R,5R)-5-(6-amino-2-(methylthio)-9H-purin-9-yl)-3,4-dihydroxytetrahydrofuran-2-yl)methyl trihydrogen diphosphate 2-MeS-ADP CHEMBL435402 | [({[(2R,3S,4R,5R)-5-[6-amino-2-(methylsulfanyl)-9H-purin-9-yl]-3,4-dihydroxyoxolan-2-yl]methoxy}(hydroxy)phosphoryl)oxy]phosphonic acid
Type:
Small organic molecule
Emp. Form.:
C11H17N5O10P2S
Mol. Mass.:
473.293
SMILES:
CSc1nc(N)c2ncn([C@@H]3O[C@H](COP(O)(=O)OP(O)(O)=O)[C@@H](O)[C@H]3O)c2n1
: