Target
P2Y purinoceptor 1
Ligand
BDBM50315824
Substrate
Meas. Tech.
ChEMBL_626109 (CHEMBL1111635)
EC50
2130±n/a nM
Citation
 Eliahu, SMartín-Gil, APerez de Lara, MJPintor, JCamden, JWeisman, GALecka, JSévigny, JFischer, B 2-MeS-beta,gamma-CCl2-ATP is a potent agent for reducing intraocular pressure. J Med Chem 53:3305-19 (2010)  
Target
Name:
P2Y purinoceptor 1
Synonyms:
P2RY1 | P2RY1_MELGA
Type:
Mol. Mass.:
41199.64
Organism:
Meleagris gallopavo
Description:
Residue:
362
  
Inhibitor
Name:
BDBM50315824
Synonyms:
({[({[(2R,3S,4R,5R)-5-[6-amino-2-(methylsulfanyl)-9H-purin-9-yl]-3,4-dihydroxyoxolan-2-yl]methoxy}(boranuidyl)phosphoryl)oxy]phosphinato}difluoromethyl)phosphonate | CHEMBL2448444
Type:
Small organic molecule
Emp. Form.:
C12H19BF2N5O11P3S
Mol. Mass.:
583.1
SMILES:
BP(=O)(OC[C@H]1O[C@H]([C@H](O)[C@@H]1O)n1cnc2c(N)nc(SC)nc12)OP(O)(=O)C(F)(F)P(O)(O)=O
: