Target
P2Y purinoceptor 1
Ligand
BDBM50315827
Substrate
Meas. Tech.
ChEMBL_626109 (CHEMBL1111635)
EC50
3100±n/a nM
Citation
 Eliahu, SMartín-Gil, APerez de Lara, MJPintor, JCamden, JWeisman, GALecka, JSévigny, JFischer, B 2-MeS-beta,gamma-CCl2-ATP is a potent agent for reducing intraocular pressure. J Med Chem 53:3305-19 (2010)  
Target
Name:
P2Y purinoceptor 1
Synonyms:
P2RY1 | P2RY1_MELGA
Type:
Mol. Mass.:
41199.64
Organism:
Meleagris gallopavo
Description:
Residue:
362
  
Inhibitor
Name:
BDBM50315827
Synonyms:
CHEMBL1093205 | [({[(2R,3S,4R,5R)-5-[6-amino-2-(methylsulfanyl)-9H-purin-9-yl]-3,4-dihydroxyoxolan-2-yl]methoxy}(hydroxy)phosphoryl)dichloromethyl]phosphonic acid
Type:
Small organic molecule
Emp. Form.:
C12H17Cl2N5O9P2S
Mol. Mass.:
540.21
SMILES:
CSc1nc(N)c2ncn([C@@H]3O[C@H](COP(O)(=O)C(Cl)(Cl)P(O)(O)=O)[C@@H](O)[C@H]3O)c2n1
: