Target
Aurora kinase B
Ligand
BDBM50315841
Substrate
Meas. Tech.
ChEMBL_624741 (CHEMBL1113417)
IC50
62±n/a nM
Citation
 Blanchard, SWilliam, ADLee, ACPoulsen, ATeo, ELDeng, WTu, NTan, EGoh, KLOng, WCNg, CPGoh, KCBonday, ZSun, ET Synthesis and evaluation of alkenyl indazoles as selective Aurora kinase inhibitors. Bioorg Med Chem Lett 20:2443-7 (2010)  
Target
Name:
Aurora kinase B
Synonyms:
AIK2 AIM1 ARK2 AURKB_HUMAN Aurora B-INCENP Aurora kinase B (AURKB) STK-1 STK12 Serine/threonine-protein kinase aurora B
Type:
Protein
Mol. Mass.:
39327.72
Organism:
Homo sapiens (Human)
Description:
Q96GD4
Residue:
344
  
Inhibitor
Name:
BDBM50315841
Synonyms:
4-methyl-N-(3-(2-(5-(methylsulfonamido)-6-(pyrrolidin-1-yl)-1H-indazol-3-yl)vinyl)phenyl)piperazine-1-carboxamide | CHEMBL1093854
Type:
Small organic molecule
Emp. Form.:
C26H33N7O3S
Mol. Mass.:
523.65
SMILES:
CN1CCN(CC1)C(=O)Nc1cccc(\C=C\c2n[nH]c3cc(N4CCCC4)c(NS(C)(=O)=O)cc23)c1
: