Target
Aurora kinase B
Ligand
BDBM50315840
Substrate
Meas. Tech.
ChEMBL_624741 (CHEMBL1113417)
IC50
110±n/a nM
Citation
 Blanchard, SWilliam, ADLee, ACPoulsen, ATeo, ELDeng, WTu, NTan, EGoh, KLOng, WCNg, CPGoh, KCBonday, ZSun, ET Synthesis and evaluation of alkenyl indazoles as selective Aurora kinase inhibitors. Bioorg Med Chem Lett 20:2443-7 (2010)  
Target
Name:
Aurora kinase B
Synonyms:
AIK2 AIM1 ARK2 AURKB_HUMAN Aurora B-INCENP Aurora kinase B (AURKB) STK-1 STK12 Serine/threonine-protein kinase aurora B
Type:
Protein
Mol. Mass.:
39327.72
Organism:
Homo sapiens (Human)
Description:
Q96GD4
Residue:
344
  
Inhibitor
Name:
BDBM50315840
Synonyms:
CHEMBL1090237 | N-(6-(pyrrolidin-1-yl)-3-styryl-1H-indazol-5-yl)-2-(thiophen-2-yl)acetamide
Type:
Small organic molecule
Emp. Form.:
C25H24N4OS
Mol. Mass.:
428.549
SMILES:
O=C(Cc1cccs1)Nc1cc2c(\C=C\c3ccccc3)n[nH]c2cc1N1CCCC1
: