Target
Aurora kinase A
Ligand
BDBM50315840
Substrate
Meas. Tech.
ChEMBL_624739 (CHEMBL1113415)
IC50
91±n/a nM
Citation
 Blanchard, SWilliam, ADLee, ACPoulsen, ATeo, ELDeng, WTu, NTan, EGoh, KLOng, WCNg, CPGoh, KCBonday, ZSun, ET Synthesis and evaluation of alkenyl indazoles as selective Aurora kinase inhibitors. Bioorg Med Chem Lett 20:2443-7 (2010)  
Target
Name:
Aurora kinase A
Synonyms:
AIK ARK-1 AURA AURKA_HUMAN Aurora 2 Aurora kinase A (AURKA) Aurora kinase A (Aurora-2) Aurora/IPL1-related kinase 1 Breast tumor-amplified kinase IAK1 STK15 GN Serine/threonine kinase 15 Serine/threonine-protein kinase 6 Serine/threonine-protein kinase aurora-A aurora-2 | hARK1
Type:
Serine/threonine-protein kinase
Mol. Mass.:
45830.98
Organism:
Homo sapiens (Human)
Description:
O14965
Residue:
403
  
Inhibitor
Name:
BDBM50315840
Synonyms:
CHEMBL1090237 | N-(6-(pyrrolidin-1-yl)-3-styryl-1H-indazol-5-yl)-2-(thiophen-2-yl)acetamide
Type:
Small organic molecule
Emp. Form.:
C25H24N4OS
Mol. Mass.:
428.549
SMILES:
O=C(Cc1cccs1)Nc1cc2c(\C=C\c3ccccc3)n[nH]c2cc1N1CCCC1
: