Target
Mitogen-activated protein kinase 14
Ligand
BDBM50315929
Substrate
Meas. Tech.
ChEMBL_625728 (CHEMBL1103558)
IC50
81±n/a nM
Citation
 Tester, RTan, XLuedtke, GRNashashibi, ISchinzel, KLiang, WJung, JDugar, SLiclican, ATabora, JLevy, DEDo, S Amide-based inhibitors of p38alpha MAP kinase. Part 2: design, synthesis and SAR of potent N-pyrimidyl amides. Bioorg Med Chem Lett 20:2560-3 (2010)  
Target
Name:
Mitogen-activated protein kinase 14
Synonyms:
CSAID-binding protein CSBP1 CSPB1 MAP kinase 14 MAP kinase p38 alpha MAPK14 MK14_HUMAN Mitogen-activated protein kinase p38 alpha Stress-activated protein kinase 2a | p38 MAP kinase alpha/beta
Type:
Serine/threonine-protein kinase
Mol. Mass.:
41286.76
Organism:
Homo sapiens (Human)
Description:
Q16539
Residue:
360
  
Inhibitor
Name:
BDBM50315929
Synonyms:
(S)-3-chloro-N-ethyl-N-(2-(1-phenylethylamino)pyrimidin-4-yl)benzamide | CHEMBL1092349
Type:
Small organic molecule
Emp. Form.:
C21H21ClN4O
Mol. Mass.:
380.871
SMILES:
CCN(C(=O)c1cccc(Cl)c1)c1ccnc(N[C@@H](C)c2ccccc2)n1
: