Target
Aminopeptidase N
Ligand
BDBM50024602
Substrate
Meas. Tech.
ChEMBL_623297 (CHEMBL1115220)
IC50
104000±n/a nM
Citation
 Grzywa, RSokol, AMSienczyk, MRadziszewicz, MKosciolek, BCarty, MPOleksyszyn, J New aromatic monoesters of alpha-aminoaralkylphosphonic acids as inhibitors of aminopeptidase N/CD13. Bioorg Med Chem 18:2930-6 (2010)  
Target
Name:
Aminopeptidase N
Synonyms:
AMPN_PIG AP-M Alanyl aminopeptidase Aminopeptidase N (APN) Microsomal aminopeptidase pAPN
Type:
Protein
Mol. Mass.:
108810.25
Organism:
Sus scrofa (Pig)
Description:
P15145
Residue:
963
  
Inhibitor
Name:
BDBM50024602
Synonyms:
1-Ammonium-2-methyl-propane-1-phosphonic acid anion CHEMBL41544
Type:
Small organic molecule
Emp. Form.:
C4H12NO3P
Mol. Mass.:
153.1167
SMILES:
CC(C)C([NH3+])P(O)([O-])=O
: