Target
Phosphatidylinositol 4,5-bisphosphate 3-kinase catalytic subunit gamma isoform
Ligand
BDBM35590
Substrate
Meas. Tech.
ChEMBL_628495 (CHEMBL1104617)
IC50
1697±n/a nM
Citation
 Verheijen, JCRichard, DJCurran, KKaplan, JLefever, MNowak, PMalwitz, DJBrooijmans, NToral-Barza, LZhang, WGLucas, JHollander, IAyral-Kaloustian, SMansour, TSYu, KZask, A Discovery of 4-morpholino-6-aryl-1H-pyrazolo[3,4-d]pyrimidines as highly potent and selective ATP-competitive inhibitors of the mammalian target of rapamycin (mTOR): optimization of the 6-aryl substituent. J Med Chem 52:8010-24 (2009)  
Target
Name:
Phosphatidylinositol 4,5-bisphosphate 3-kinase catalytic subunit gamma isoform
Synonyms:
PI3-kinase p110 subunit gamma PI3Kgamma PK3CG_HUMAN Phosphatidylinositol 4,5-bisphosphate 3-kinase (PI3K) Phosphatidylinositol 4,5-bisphosphate 3-kinase catalytic subunit gamma (PI3Kgamma) Phosphatidylinositol 4,5-bisphosphate 3-kinase catalytic subunit gamma isoform (PI3K) Phosphatidylinositol-4,5-bisphosphate 3-kinase catalytic subunit gamma isoform Phosphoinositide 3-kinases gamma (PI3K gamma) p120-PI3K
Type:
Enzyme Subunit
Mol. Mass.:
126470.30
Organism:
Homo sapiens (Human)
Description:
P48736
Residue:
1102
  
Inhibitor
Name:
BDBM35590
Synonyms:
pyrazolo pyrimidine, 22
Type:
Small organic molecule
Emp. Form.:
C25H31FN8O4
Mol. Mass.:
526.5632
SMILES:
COC(=O)N1CCC(CC1)n1ncc2c(nc(nc12)-c1ccc(NC(=O)NCCF)cc1)N1CCOCC1
: