Target
6,7-dimethyl-8-ribityllumazine synthase
Ligand
BDBM50316581
Substrate
Meas. Tech.
ChEMBL_631469 (CHEMBL1113888)
Ki
19000±n/a nM
Citation
 Talukdar, AMorgunova, EDuan, JMeining, WFoloppe, NNilsson, LBacher, AIllarionov, BFischer, MLadenstein, RCushman, M Virtual screening, selection and development of a benzindolone structural scaffold for inhibition of lumazine synthase. Bioorg Med Chem 18:3518-34 (2010)  
Target
Name:
6,7-dimethyl-8-ribityllumazine synthase
Synonyms:
RISB_MYCTU | ribH
Type:
PROTEIN
Mol. Mass.:
16367.39
Organism:
Mycobacterium tuberculosis
Description:
ChEMBL_631469
Residue:
160
  
Inhibitor
Name:
BDBM50316581
Synonyms:
5-(2-Oxo-1,2-dihydrobenzo[cd]indole-6-sulfonamido)-pentyldihydrogen phosphate | CHEMBL1097478
Type:
Small organic molecule
Emp. Form.:
C16H19N2O7PS
Mol. Mass.:
414.37
SMILES:
OP(O)(=O)OCCCCCNS(=O)(=O)c1ccc2NC(=O)c3cccc1c23
: