Target
Adenosine receptor A2a
Ligand
BDBM50316874
Substrate
Meas. Tech.
ChEMBL_629845 (CHEMBL1116482)
Ki
16.8±n/a nM
Citation
 Shook, BCRassnick, SChakravarty, DWallace, NAult, MCrooke, JBarbay, JKWang, ALeonard, KPowell, MTAlford, VHall, DRupert, KCHeintzelman, GRHansen, KBullington, JLScannevin, RHCarroll, KLampron, LWestover, LRussell, RBranum, SWells, KDamon, SYouells, SBeauchamp, DLi, XRhodes, KJackson, PF Optimization of arylindenopyrimidines as potent adenosine A(2A)/A(1) antagonists. Bioorg Med Chem Lett 20:2868-71 (2010)  
Target
Name:
Adenosine receptor A2a
Synonyms:
A2A adenosine receptor (hA2A) ADENOSINE A2 ADORA2 Adenosine A2A receptor (A2AAR)
Type:
G Protein-Coupled Receptor (GPCR)
Mol. Mass.:
44716.46
Organism:
Homo sapiens (Human)
Description:
P29274
Residue:
412
  
Inhibitor
Name:
BDBM50316874
Synonyms:
2-amino-N-(1-isopropylpiperidin-4-yl)-5-oxo-4-phenyl-5H-indeno[1,2-d]pyrimidine-8-carboxamide | CHEMBL1087183
Type:
Small organic molecule
Emp. Form.:
C26H27N5O2
Mol. Mass.:
441.5249
SMILES:
CC(C)N1CCC(CC1)NC(=O)c1ccc2C(=O)c3c(nc(N)nc3-c3ccccc3)-c2c1
: