Target
Acetylcholinesterase
Ligand
BDBM50316980
Substrate
Meas. Tech.
ChEMBL_630123 (CHEMBL1113714)
IC50
510±n/a nM
Citation
 Young, SFabio, KGuillon, CMohanta, PHalton, TAHeck, DEFlowers, RALaskin, JDHeindel, ND Peripheral site acetylcholinesterase inhibitors targeting both inflammation and cholinergic dysfunction. Bioorg Med Chem Lett 20:2987-90 (2010)  
Target
Name:
Acetylcholinesterase
Synonyms:
ACES_ELEEL Acetylcholinesterase (EeAChE) | ache
Type:
Enzyme
Mol. Mass.:
71812.79
Organism:
Electrophorus electricus (Electric eel)
Description:
Residue:
633
  
Inhibitor
Name:
BDBM50316980
Synonyms:
4-((3,3-Dimethylbutoxy)carbonyloxy)benzyl 2-(2-(2,6-Dichlorophenylamino)phenyl)acetate | CHEMBL1087206
Type:
Small organic molecule
Emp. Form.:
C28H29Cl2NO5
Mol. Mass.:
530.44
SMILES:
CC(C)(C)CCOC(=O)Oc1ccc(COC(=O)Cc2ccccc2Nc2c(Cl)cccc2Cl)cc1
: