Target
Aminodeoxychorismate lyase
Ligand
BDBM50317149
Substrate
Meas. Tech.
ChEMBL_630879 (CHEMBL1113008)
Ki
2500000±n/a nM
Citation
 Ziebart, KTDixon, SMAvila, BEl-Badri, MHGuggenheim, KGKurth, MJToney, MD Targeting multiple chorismate-utilizing enzymes with a single inhibitor: validation of a three-stage design. J Med Chem 53:3718-29 (2010)  
Target
Name:
Aminodeoxychorismate lyase
Synonyms:
PABC_ECOLI | pabC
Type:
PROTEIN
Mol. Mass.:
29714.75
Organism:
Escherichia coli (strain K12)
Description:
ChEMBL_630879
Residue:
269
  
Inhibitor
Name:
BDBM50317149
Synonyms:
2-(3-(3-((R)-3-((S)-1-Amino-3-(3-chlorophenyl)-1-oxopropan-2-ylamino)-2-(3-hydroxy-4-methyl-2-nitrobenzamido)-3-oxopropylthio)propylcarbamoyl)phenoxy)acetic Acid | CHEMBL1095961
Type:
Small organic molecule
Emp. Form.:
C32H34ClN5O10S
Mol. Mass.:
716.158
SMILES:
Cc1ccc(C(=O)N[C@@H](CSCCCNC(=O)c2cccc(OCC(O)=O)c2)C(=O)N[C@@H](Cc2cccc(Cl)c2)C(N)=O)c(c1O)[N+]([O-])=O
: