Target
11-beta-hydroxysteroid dehydrogenase type 2
Ligand
BDBM50317206
Substrate
Meas. Tech.
ChEMBL_631348 (CHEMBL1105685)
Ki
>10000±n/a nM
Citation
 Cheng, HHoffman, JLe, PNair, SKCripps, SMatthews, JSmith, CYang, MKupchinsky, SDress, KEdwards, MCole, BWalters, ELoh, CErmolieff, JFanjul, ABhat, GBHerrera, JPauly, THosea, NPaderes, GRejto, P The development and SAR of pyrrolidine carboxamide 11beta-HSD1 inhibitors. Bioorg Med Chem Lett 20:2897-902 (2010)  
Target
Name:
11-beta-hydroxysteroid dehydrogenase type 2
Synonyms:
11-DH2 11-beta-Hydroxysteroid Dehydrogenase 2 (11-beta-HSD2) 11-beta-hydroxysteroid dehydrogenase 2 11-beta-hydroxysteroid dehydrogenase type 2 (11-beta-HSD2) DHI2_HUMAN HSD11K SDR9C3
Type:
Enzyme
Mol. Mass.:
44141.72
Organism:
Homo sapiens (Human)
Description:
Purified recombinant human 11beta-HSD2.
Residue:
405
  
Inhibitor
Name:
BDBM50317206
Synonyms:
(3-Phenyl-adamantan-1-yl)-piperidin-1-yl-methanone | CHEMBL1088379
Type:
Small organic molecule
Emp. Form.:
C22H29NO
Mol. Mass.:
323.4718
SMILES:
O=C(N1CCCCC1)C12CC3CC(C1)CC(C3)(C2)c1ccccc1
: