Target
5-hydroxytryptamine receptor 2A
Ligand
BDBM50308003
Substrate
Meas. Tech.
ChEMBL_631537 (CHEMBL1103902)
Ki
11±n/a nM
Citation
 Pazini, FMenegatti, RSabino, JRAndrade, CHNeves, GRates, SMNoël, FFraga, CABarreiro, EJde Oliveira, V Design of new dopamine D2 receptor ligands: biosynthesis and pharmacological evaluation of the hydroxylated metabolite of LASSBio-581. Bioorg Med Chem Lett 20:2888-91 (2010)  
Target
Name:
5-hydroxytryptamine receptor 2A
Synonyms:
5-HT-2A 5-HT2A 5-hydroxytryptamine receptor 2A (5HT2A) Htr2 Serotonin Receptor 2A
Type:
G Protein-Coupled Receptor (GPCR)
Mol. Mass.:
52852.05
Organism:
Rattus norvegicus (rat)
Description:
Rat cortex membranes 5-HT2A receptors.
Residue:
471
  
Inhibitor
Name:
BDBM50308003
Synonyms:
1-((1-(4-chlorophenyl)-1H-1,2,3-triazol-4-yl)methyl)-4-phenylpiperazine CHEMBL609043
Type:
Small organic molecule
Emp. Form.:
C19H20ClN5
Mol. Mass.:
353.849
SMILES:
Clc1ccc(cc1)-n1cc(CN2CCN(CC2)c2ccccc2)nn1
: