Target
Sialidase
Ligand
BDBM50311583
Substrate
Meas. Tech.
ChEMBL_631812 (CHEMBL1111005)
Ki
1780±n/a nM
Citation
 Nguyen, PHNguyen, TNKang, KWNdinteh, DTMbafor, JTKim, YROh, WK Prenylated pterocarpans as bacterial neuraminidase inhibitors. Bioorg Med Chem 18:3335-44 (2010)  
Target
Name:
Sialidase
Synonyms:
NANH_CLOPF | nanH
Type:
PROTEIN
Mol. Mass.:
42808.79
Organism:
Clostridium perfringens
Description:
ChEMBL_991336
Residue:
382
  
Inhibitor
Name:
BDBM50311583
Synonyms:
Abyssinone II phaseolidin sophorapterocarpan A
Type:
Small organic molecule
Emp. Form.:
C20H20O4
Mol. Mass.:
324.3704
SMILES:
[#6]\[#6](-[#6])=[#6]\[#6]-c1c2-[#8]-[#6@@H]-3-[#6@@H](-[#6]-[#8]-c4cc(-[#8])ccc-34)-c2ccc1-[#8]
: