Target
Hepatocyte growth factor receptor
Ligand
BDBM50317749
Substrate
Meas. Tech.
ChEMBL_629463 (CHEMBL1120752)
IC50
8±n/a nM
Citation
 Williams, DKChen, XTTarby, CKaltenbach, RCai, ZWTokarski, JSAn, YSack, JSWautlet, BGullo-Brown, JHenley, BJJeyaseelan, RKellar, KManne, VTrainor, GLLombardo, LJFargnoli, JBorzilleri, RM Design, synthesis and structure-activity relationships of novel biarylamine-based Met kinase inhibitors. Bioorg Med Chem Lett 20:2998-3002 (2010)  
Target
Name:
Hepatocyte growth factor receptor
Synonyms:
Hepatocyte growth factor receptor Hepatocyte growth factor receptor (c-MET) MET Met proto-oncogene (hepatocyte growth factor receptor) Tyrosine-protein kinase Met (c-Met) c-Met kinase
Type:
Protein
Mol. Mass.:
155559.73
Organism:
Homo sapiens (Human)
Description:
P08581
Residue:
1390
  
Inhibitor
Name:
BDBM50317749
Synonyms:
2-(4-(2-aminopyridin-4-yloxy)-3-fluorophenylamino)-N-(2,4-difluorophenyl)nicotinamide CHEMBL1097142
Type:
Small organic molecule
Emp. Form.:
C23H16F3N5O2
Mol. Mass.:
451.4006
SMILES:
Nc1cc(Oc2ccc(Nc3ncccc3C(=O)Nc3ccc(F)cc3F)cc2F)ccn1
: