Target
Metabotropic glutamate receptor 5
Ligand
BDBM50318382
Substrate
Meas. Tech.
ChEMBL_630003 (CHEMBL1113002)
Ki
3.8±n/a nM
Citation
 Baumann, CAMu, LJohannsen, SHoner, MSchubiger, PAAmetamey, SM Structure-activity relationships of fluorinated (E)-3-((6-methylpyridin-2-yl)ethynyl)cyclohex-2-enone-O-methyloxime (ABP688) derivatives and the discovery of a high affinity analogue as a potential candidate for imaging metabotropic glutamate recepors subtype 5 (mGluR5) with positron emission tomog J Med Chem 53:4009-17 (2010)  
Target
Name:
Metabotropic glutamate receptor 5
Synonyms:
GRM5_RAT Grm5 Mglur5 metabotropic glutamate 5/1-C metabotropic glutamate 5a
Type:
Enzyme
Mol. Mass.:
131900.14
Organism:
Rattus norvegicus (Rat)
Description:
P31424
Residue:
1203
  
Inhibitor
Name:
BDBM50318382
Synonyms:
3-[pyridine-2-yl)ethynyl]cyclohex-2-enone-O-fluoroethyloxyethyloxime CHEMBL1094807
Type:
Small organic molecule
Emp. Form.:
C17H19FN2O2
Mol. Mass.:
302.3434
SMILES:
FCCOCCO\N=C1/CCCC(=C1)C#Cc1ccccn1
: