Target
Acetylcholinesterase
Ligand
BDBM50004036
Substrate
Meas. Tech.
ChEMBL_633769 (CHEMBL1119333)
IC50
64±n/a nM
Citation
 Lv, WXue, Y Prediction of acetylcholinesterase inhibitors and characterization of correlative molecular descriptors by machine learning methods. Eur J Med Chem 45:1167-72 (2010)  
Target
Name:
Acetylcholinesterase
Synonyms:
ACES_HUMAN Acetylcholinesterase (AChE) | Acetylcholinesterase (human AChE)
Type:
Enzyme
Mol. Mass.:
67792.70
Organism:
Homo sapiens (Human)
Description:
P22303
Residue:
614
  
Inhibitor
Name:
BDBM50004036
Synonyms:
CHEMBL340621 N-[2-(1-Benzyl-piperidin-4-yl)-ethyl]-N-phenyl-isonicotinamide
Type:
Small organic molecule
Emp. Form.:
C26H29N3O
Mol. Mass.:
399.528
SMILES:
O=C(N(CCC1CCN(Cc2ccccc2)CC1)c1ccccc1)c1ccncc1
: