Target
Histone deacetylase 4
Ligand
BDBM50319209
Substrate
Meas. Tech.
ChEMBL_633819 (CHEMBL1119897)
Ki
6±n/a nM
Citation
 Wang, HLim, ZYZhou, YNg, MLu, TLee, KSangthongpitag, KGoh, KCWang, XWu, XKhng, HHGoh, SKOng, WCBonday, ZSun, ET Acylurea connected straight chain hydroxamates as novel histone deacetylase inhibitors: Synthesis, SAR, and in vivo antitumor activity. Bioorg Med Chem Lett 20:3314-21 (2010)  
Target
Name:
Histone deacetylase 4
Synonyms:
Cereblon/Histone deacetylase 4 HDAC4 Histone acetylase 4(HDAC4) KIAA0288
Type:
Enzyme
Mol. Mass.:
119049.39
Organism:
Homo sapiens (Human)
Description:
P56524
Residue:
1084
  
Inhibitor
Name:
BDBM50319209
Synonyms:
6-[3-(4-Bromo-benzoyl)-ureido]-hexanoic acid hydroxyamide | CHEMBL1083086
Type:
Small organic molecule
Emp. Form.:
C14H18BrN3O4
Mol. Mass.:
372.214
SMILES:
ONC(=O)CCCCCNC(=O)NC(=O)c1ccc(Br)cc1
: