Target
Histone deacetylase 6
Ligand
BDBM50319209
Substrate
Meas. Tech.
ChEMBL_633821 (CHEMBL1119899)
Ki
8±n/a nM
Citation
 Wang, HLim, ZYZhou, YNg, MLu, TLee, KSangthongpitag, KGoh, KCWang, XWu, XKhng, HHGoh, SKOng, WCBonday, ZSun, ET Acylurea connected straight chain hydroxamates as novel histone deacetylase inhibitors: Synthesis, SAR, and in vivo antitumor activity. Bioorg Med Chem Lett 20:3314-21 (2010)  
Target
Name:
Histone deacetylase 6
Synonyms:
Cereblon/Histone deacetylase 6 HDAC6 Histone deacetylase 6 (HDAC6) KIAA0901 | ORF Names:JM21
Type:
Chromatin regulator; hydrolase; repressor
Mol. Mass.:
131381.51
Organism:
Homo sapiens (Human)
Description:
Q9UBN7
Residue:
1215
  
Inhibitor
Name:
BDBM50319209
Synonyms:
6-[3-(4-Bromo-benzoyl)-ureido]-hexanoic acid hydroxyamide | CHEMBL1083086
Type:
Small organic molecule
Emp. Form.:
C14H18BrN3O4
Mol. Mass.:
372.214
SMILES:
ONC(=O)CCCCCNC(=O)NC(=O)c1ccc(Br)cc1
: