Target
Histamine H1 receptor
Ligand
BDBM50319302
Substrate
Meas. Tech.
ChEMBL_634018 (CHEMBL1117991)
EC50
>10000±n/a nM
Citation
 Savall, BMEdwards, JPVenable, JDBuzard, DJThurmond, RHack, MMcGovern, P Agonist/antagonist modulation in a series of 2-aryl benzimidazole H4 receptor ligands. Bioorg Med Chem Lett 20:3367-71 (2010)  
Target
Name:
Histamine H1 receptor
Synonyms:
H1R HISTAMINE H1 HRH1_HUMAN
Type:
G Protein-Coupled Receptor (GPCR)
Mol. Mass.:
55808.72
Organism:
Homo sapiens (Human)
Description:
Cell pellets from SK-N-MC cells transfected with human H1 receptor were used in binding assay.
Residue:
487
  
Inhibitor
Name:
BDBM50319302
Synonyms:
5-(3-(4-(5-fluoro-4-methyl-1H-benzo[d]imidazol-2-yl)-3-methylphenoxy)propyl)-4,5,6,7-tetrahydro-3H-imidazo[4,5-c]pyridine | CHEMBL1086105
Type:
Small organic molecule
Emp. Form.:
C24H26FN5O
Mol. Mass.:
419.4945
SMILES:
Cc1cc(OCCCN2CCc3nc[nH]c3C2)ccc1-c1nc2ccc(F)c(C)c2[nH]1
: