Target
Prostaglandin E2 receptor EP4 subtype
Ligand
BDBM50319836
Substrate
Meas. Tech.
ChEMBL_634905 (CHEMBL1120632)
Ki
0.310000±n/a nM
Citation
 Colucci, JBoyd, MBerthelette, CChiasson, JFWang, ZDucharme, YFriesen, RWrona, MLevesque, JFDenis, DMathieu, MCStocco, RTherien, AGClarke, PRowland, SXu, DHan, Y Discovery of 4-[1-[([1-[4-(trifluoromethyl)benzyl]-1H-indol-7-yl]carbonyl)amino]cyclopropyl]benzoic acid (MF-766), a highly potent and selective EP4 antagonist for treating inflammatory pain. Bioorg Med Chem Lett 20:3760-3 (2010)  
Target
Name:
Prostaglandin E2 receptor EP4 subtype
Synonyms:
PE2R4_HUMAN PGE2 receptor EP4 subtype PTGER4 Prostanoid EP4 receptor
Type:
Enzyme
Mol. Mass.:
53134.53
Organism:
Homo sapiens (Human)
Description:
P35408
Residue:
488
  
Inhibitor
Name:
BDBM50319836
Synonyms:
4-(1-(5-chloro-1-(4-(trifluoromethyl)benzyl)-1H-indole-7-carboxamido)cyclopropyl)benzoic acid | CHEMBL1086490
Type:
Small organic molecule
Emp. Form.:
C27H20ClF3N2O3
Mol. Mass.:
512.908
SMILES:
OC(=O)c1ccc(cc1)C1(CC1)NC(=O)c1cc(Cl)cc2ccn(Cc3ccc(cc3)C(F)(F)F)c12
: