Target
5-hydroxytryptamine receptor 2A
Ligand
BDBM50320370
Substrate
Meas. Tech.
ChEMBL_633900 (CHEMBL1120466)
Ki
1.32±n/a nM
Citation
 Ladduwahetty, TGilligan, MHumphries, AMerchant, KJFish, RMcAlister, GIvarsson, MDominguez, MO'Connor, DMacLeod, AM Non-basic ligands for aminergic GPCRs: the discovery and development diaryl sulfones as selective, orally bioavailable 5-HT2A receptor antagonists for the treatment of sleep disorders. Bioorg Med Chem Lett 20:3708-12 (2010)  
Target
Name:
5-hydroxytryptamine receptor 2A
Synonyms:
5-HT-2 5-HT2A 5-hydroxytryptamine receptor 2A (5HT-2A) 5HT2A_HUMAN HTR2A | Serotonin receptor 2A
Type:
undefined
Mol. Mass.:
52607.65
Organism:
Homo sapiens (Human)
Description:
P28223
Residue:
471
  
Inhibitor
Name:
BDBM50320370
Synonyms:
(E)-2,4-difluoro-1-(4-(phenylsulfonyl)styryl)benzene | CHEMBL1082773
Type:
Small organic molecule
Emp. Form.:
C20H14F2O2S
Mol. Mass.:
356.386
SMILES:
Fc1ccc(\C=C\c2ccc(cc2)S(=O)(=O)c2ccccc2)c(F)c1
: