Target
5-hydroxytryptamine receptor 2C
Ligand
BDBM50320370
Substrate
Meas. Tech.
ChEMBL_633901 (CHEMBL1120467)
Ki
65±n/a nM
Citation
 Ladduwahetty, TGilligan, MHumphries, AMerchant, KJFish, RMcAlister, GIvarsson, MDominguez, MO'Connor, DMacLeod, AM Non-basic ligands for aminergic GPCRs: the discovery and development diaryl sulfones as selective, orally bioavailable 5-HT2A receptor antagonists for the treatment of sleep disorders. Bioorg Med Chem Lett 20:3708-12 (2010)  
Target
Name:
5-hydroxytryptamine receptor 2C
Synonyms:
5-HT-1C 5-HT1C 5-HT2C-INI 5-HTR2C 5-hydroxytryptamine receptor 2C (5-HT-2C) 5HT-1C HTR1C Serotonin (5-HT3) receptor Serotonin Receptor 2C
Type:
G Protein-Coupled Receptor (GPCR)
Mol. Mass.:
51836.79
Organism:
Homo sapiens (Human)
Description:
P28335
Residue:
458
  
Inhibitor
Name:
BDBM50320370
Synonyms:
(E)-2,4-difluoro-1-(4-(phenylsulfonyl)styryl)benzene | CHEMBL1082773
Type:
Small organic molecule
Emp. Form.:
C20H14F2O2S
Mol. Mass.:
356.386
SMILES:
Fc1ccc(\C=C\c2ccc(cc2)S(=O)(=O)c2ccccc2)c(F)c1
: