Target
Ileal sodium/bile acid cotransporter
Ligand
BDBM50322475
Substrate
Meas. Tech.
ChEMBL_643281 (CHEMBL1177270)
Ki
2020±n/a nM
Citation
 Rais, RAcharya, CTririya, GMackerell, ADPolli, JE Molecular switch controlling the binding of anionic bile acid conjugates to human apical sodium-dependent bile acid transporter. J Med Chem 53:4749-60 (2010)  
Target
Name:
Ileal sodium/bile acid cotransporter
Synonyms:
ASBT IBAT Ileal Na(+)/bile acid cotransporter Ileal bile acid transporter/bile acid cotransporter NTCP2 SLC10A2
Type:
Enzyme
Mol. Mass.:
37714.89
Organism:
Homo sapiens (Human)
Description:
SLC10A2
Residue:
348
  
Inhibitor
Name:
BDBM50322475
Synonyms:
(2S)-2-((4R)-4-((3R,7R,8R,9S,10S,13R,14S,17R)-3,7-dihydroxy-10,13-dimethylhexadecahydro-1H-cyclopenta[a]phenanthren-17-yl)pentanamido)-5-oxo-5-(4-(trifluoromethyl)phenylamino)pentanoate | CHEMBL1170055
Type:
Small organic molecule
Emp. Form.:
C36H51F3N2O6
Mol. Mass.:
664.7951
SMILES:
C[C@H](CCC(=O)N[C@@H](CCC(=O)Nc1ccc(cc1)C(F)(F)F)C(O)=O)[C@H]1CC[C@H]2[C@@H]3[C@H](O)C[C@H]4C[C@H](O)CC[C@]4(C)[C@H]3CC[C@]12C
: