Target
Sodium-dependent dopamine transporter
Ligand
BDBM50322518
Substrate
Meas. Tech.
ChEMBL_641576 (CHEMBL1176113)
IC50
70.0±n/a nM
Citation
 Lukas, RJMuresan, AZDamaj, MIBlough, BEHuang, XNavarro, HAMascarella, SWEaton, JBMarxer-Miller, SKCarroll, FI Synthesis and characterization of in vitro and in vivo profiles of hydroxybupropion analogues: aids to smoking cessation. J Med Chem 53:4731-48 (2010)  
Target
Name:
Sodium-dependent dopamine transporter
Synonyms:
DA transporter DAT1 Dopamine transporter protein (DAT) SC6A3_HUMAN Sodium-dependent dopamine transporter Solute carrier family 6 member 3
Type:
Multi-pass membrane protein
Mol. Mass.:
68497.11
Organism:
Homo sapiens (Human)
Description:
Q01959
Residue:
620
  
Inhibitor
Name:
BDBM50322518
Synonyms:
(+/-)2-(3,4-Dichlorophenyl)-3,5,5-trimethylmorpholin-2-ol | CHEMBL1173428
Type:
Small organic molecule
Emp. Form.:
C13H17Cl2NO2
Mol. Mass.:
290.186
SMILES:
CC1NC(C)(C)COC1(O)c1ccc(Cl)c(Cl)c1
: