Target
Sodium-dependent serotonin transporter
Ligand
BDBM50322518
Substrate
Meas. Tech.
ChEMBL_641578 (CHEMBL1176115)
IC50
360±n/a nM
Citation
 Lukas, RJMuresan, AZDamaj, MIBlough, BEHuang, XNavarro, HAMascarella, SWEaton, JBMarxer-Miller, SKCarroll, FI Synthesis and characterization of in vitro and in vivo profiles of hydroxybupropion analogues: aids to smoking cessation. J Med Chem 53:4731-48 (2010)  
Target
Name:
Sodium-dependent serotonin transporter
Synonyms:
5-HT Transporter 5HTT SC6A4_HUMAN SLC6A4 Serotonin transporter (5HTT) Sodium-dependent serotonin transporter (SERT) | Solute carrier family 6 member 4
Type:
Multi-pass membrane protein
Mol. Mass.:
70322.51
Organism:
Homo sapiens (Human)
Description:
P31645
Residue:
630
  
Inhibitor
Name:
BDBM50322518
Synonyms:
(+/-)2-(3,4-Dichlorophenyl)-3,5,5-trimethylmorpholin-2-ol | CHEMBL1173428
Type:
Small organic molecule
Emp. Form.:
C13H17Cl2NO2
Mol. Mass.:
290.186
SMILES:
CC1NC(C)(C)COC1(O)c1ccc(Cl)c(Cl)c1
: