Target
Neuronal acetylcholine receptor subunit alpha-4/beta-4
Ligand
BDBM50322518
Substrate
Meas. Tech.
ChEMBL_641587 (CHEMBL1176289)
IC50
14000±n/a nM
Citation
 Lukas, RJMuresan, AZDamaj, MIBlough, BEHuang, XNavarro, HAMascarella, SWEaton, JBMarxer-Miller, SKCarroll, FI Synthesis and characterization of in vitro and in vivo profiles of hydroxybupropion analogues: aids to smoking cessation. J Med Chem 53:4731-48 (2010)  
Target
Name:
Neuronal acetylcholine receptor subunit alpha-4/beta-4
Synonyms:
Neuronal acetylcholine receptor protein alpha-4/beta-4 subunit | Neuronal acetylcholine receptor; alpha4/beta4
Type:
Mol. Mass.:
Description:
ASSAY_ID of EBI is 143890
Components:
This complex has 2 components.
Component 1
Name:
Neuronal acetylcholine receptor subunit beta-4
Synonyms:
ACHB4_HUMAN Cholinergic, Nicotinic Alpha6Beta3Beta4Alpha5 Nicotinic acetylcholine receptor alpha6/alpha3/beta4
Type:
Enzyme Catalytic Domain
Mol. Mass.:
56388.51
Organism:
Homo sapiens (Human)
Description:
Cholinergic, Nicotinic Alpha6Beta3Beta4Alpha5 0 HUMAN::P30926
Residue:
498
  
Component 2
Name:
Neuronal acetylcholine receptor subunit alpha-4
Synonyms:
ACHA4_HUMAN CHRNA4 protein Neuronal acetylcholine receptor protein alpha-4 subunit Nicotinic acetylcholine receptor alpha4/beta2/alpha5
Type:
Mol. Mass.:
69963.49
Organism:
Homo sapiens (Human)
Description:
NACHRA4
Residue:
627
  
Inhibitor
Name:
BDBM50322518
Synonyms:
(+/-)2-(3,4-Dichlorophenyl)-3,5,5-trimethylmorpholin-2-ol | CHEMBL1173428
Type:
Small organic molecule
Emp. Form.:
C13H17Cl2NO2
Mol. Mass.:
290.186
SMILES:
CC1NC(C)(C)COC1(O)c1ccc(Cl)c(Cl)c1
: