Target
C3a anaphylatoxin chemotactic receptor
Ligand
BDBM50322616
Substrate
Meas. Tech.
ChEMBL_642036 (CHEMBL1176068)
IC50
27000±n/a nM
Citation
 Scully, CCBlakeney, JSSingh, RHoang, HNAbbenante, GReid, RCFairlie, DP Selective hexapeptide agonists and antagonists for human complement C3a receptor. J Med Chem 53:4938-48 (2010)  
Target
Name:
C3a anaphylatoxin chemotactic receptor
Synonyms:
AZ3B C3AR1 C3R1 HNFAG09
Type:
PROTEIN
Mol. Mass.:
53864.66
Organism:
Homo sapiens (Human)
Description:
ChEMBL_642034
Residue:
482
  
Inhibitor
Name:
BDBM50322616
Synonyms:
(S)-2-((S)-1-((S)-2-((S)-1-((S)-2-amino-3-(1H-indol-3-yl)propanoyl)pyrrolidine-2-carboxamido)-4-methylpentanoyl)pyrrolidine-2-carboxamido)-5-guanidinopentanoic acid | CHEMBL1170033
Type:
Small organic molecule
Emp. Form.:
C33H49N9O6
Mol. Mass.:
667.7989
SMILES:
CC(C)C[C@H](NC(=O)[C@@H]1CCCN1C(=O)[C@@H](N)Cc1c[nH]c2ccccc12)C(=O)N1CCC[C@H]1C(=O)N[C@@H](CCCNC(N)=N)C(O)=O
: