Target
Cannabinoid receptor 1
Ligand
BDBM50323001
Substrate
Meas. Tech.
ChEMBL_643523 (CHEMBL1212387)
IC50
180±n/a nM
Citation
 Hortala, LRinaldi-Carmona, MCongy, CBoulu, LSadoun, FFabre, GFinance, OBarth, F Rational design of a novel peripherally-restricted, orally active CB(1) cannabinoid antagonist containing a 2,3-diarylpyrrole motif. Bioorg Med Chem Lett 20:4573-7 (2010)  
Target
Name:
Cannabinoid receptor 1
Synonyms:
Brain-type cannabinoid receptor CB-R CNR1_RAT Cannabinoid receptor Cnr1 | Skr6
Type:
G Protein-Coupled Receptor (GPCR)
Mol. Mass.:
52856.55
Organism:
Rattus norvegicus (rat)
Description:
P20272
Residue:
473
  
Inhibitor
Name:
BDBM50323001
Synonyms:
3-(5-(4'-carbamoyl-1,4'-bipiperidine-1'-carbonyl)-2-(4-chlorophenyl)-3-(2,4-dichlorophenyl)-1H-pyrrol-1-yl)propanoic acid | CHEMBL1210777
Type:
Small organic molecule
Emp. Form.:
C31H33Cl3N4O4
Mol. Mass.:
631.977
SMILES:
NC(=O)C1(CCN(CC1)C(=O)c1cc(c(-c2ccc(Cl)cc2)n1CCC(O)=O)-c1ccc(Cl)cc1Cl)N1CCCCC1
: