Target
Cannabinoid receptor 1
Ligand
BDBM50323002
Substrate
Meas. Tech.
ChEMBL_643523 (CHEMBL1212387)
IC50
160±n/a nM
Citation
 Hortala, LRinaldi-Carmona, MCongy, CBoulu, LSadoun, FFabre, GFinance, OBarth, F Rational design of a novel peripherally-restricted, orally active CB(1) cannabinoid antagonist containing a 2,3-diarylpyrrole motif. Bioorg Med Chem Lett 20:4573-7 (2010)  
Target
Name:
Cannabinoid receptor 1
Synonyms:
Brain-type cannabinoid receptor CB-R CNR1_RAT Cannabinoid receptor Cnr1 | Skr6
Type:
G Protein-Coupled Receptor (GPCR)
Mol. Mass.:
52856.55
Organism:
Rattus norvegicus (rat)
Description:
P20272
Residue:
473
  
Inhibitor
Name:
BDBM50323002
Synonyms:
5-(5-(4'-carbamoyl-1,4'-bipiperidine-1'-carbonyl)-2-(4-chlorophenyl)-3-(2,4-dichlorophenyl)-1H-pyrrol-1-yl)-2,2-dimethylpentanoic acid | CHEMBL1210778
Type:
Small organic molecule
Emp. Form.:
C35H41Cl3N4O4
Mol. Mass.:
688.083
SMILES:
CC(C)(CCCn1c(cc(c1-c1ccc(Cl)cc1)-c1ccc(Cl)cc1Cl)C(=O)N1CCC(CC1)(N1CCCCC1)C(N)=O)C(O)=O
: