Target
Cannabinoid receptor 1
Ligand
BDBM50323005
Substrate
Meas. Tech.
ChEMBL_643523 (CHEMBL1212387)
IC50
4.3±n/a nM
Citation
 Hortala, LRinaldi-Carmona, MCongy, CBoulu, LSadoun, FFabre, GFinance, OBarth, F Rational design of a novel peripherally-restricted, orally active CB(1) cannabinoid antagonist containing a 2,3-diarylpyrrole motif. Bioorg Med Chem Lett 20:4573-7 (2010)  
Target
Name:
Cannabinoid receptor 1
Synonyms:
Brain-type cannabinoid receptor CB-R CNR1_RAT Cannabinoid receptor Cnr1 | Skr6
Type:
G Protein-Coupled Receptor (GPCR)
Mol. Mass.:
52856.55
Organism:
Rattus norvegicus (rat)
Description:
P20272
Residue:
473
  
Inhibitor
Name:
BDBM50323005
Synonyms:
1'-(5-(4-chlorophenyl)-4-(2,4-dichlorophenyl)-1-(3-(methylsulfonamido)propyl)-1H-pyrrole-2-carbonyl)-4,4-dimethyl-1,4'-bipiperidine-4'-carboxamide | CHEMBL1210781
Type:
Small organic molecule
Emp. Form.:
C34H42Cl3N5O4S
Mol. Mass.:
723.152
SMILES:
CC1(C)CCN(CC1)C1(CCN(CC1)C(=O)c1cc(c(-c2ccc(Cl)cc2)n1CCCNS(C)(=O)=O)-c1ccc(Cl)cc1Cl)C(N)=O
: