Target
Cannabinoid receptor 1
Ligand
BDBM50323006
Substrate
Meas. Tech.
ChEMBL_643538 (CHEMBL1212402)
EC50
15±n/a nM
Citation
 Hortala, LRinaldi-Carmona, MCongy, CBoulu, LSadoun, FFabre, GFinance, OBarth, F Rational design of a novel peripherally-restricted, orally active CB(1) cannabinoid antagonist containing a 2,3-diarylpyrrole motif. Bioorg Med Chem Lett 20:4573-7 (2010)  
Target
Name:
Cannabinoid receptor 1
Synonyms:
CANN6 CB-R CNR CNR1_HUMAN Cannabinoid receptor Cannabinoid receptor 1 (brain)
Type:
G Protein-Coupled Receptor (GPCR)
Mol. Mass.:
52868.96
Organism:
Homo sapiens (Human)
Description:
P21554
Residue:
472
  
Inhibitor
Name:
BDBM50323006
Synonyms:
1'-(5-(4-chlorophenyl)-4-(2,4-dichlorophenyl)-1-(3-(methylsulfonamido)propyl)-1H-pyrrole-2-carbonyl)-4,4-difluoro-1,4'-bipiperidine-4'-carboxamide | CHEMBL1210782
Type:
Small organic molecule
Emp. Form.:
C32H36Cl3F2N5O4S
Mol. Mass.:
731.08
SMILES:
CS(=O)(=O)NCCCn1c(cc(c1-c1ccc(Cl)cc1)-c1ccc(Cl)cc1Cl)C(=O)N1CCC(CC1)(N1CCC(F)(F)CC1)C(N)=O
: