Target
Cannabinoid receptor 1
Ligand
BDBM50323007
Substrate
Meas. Tech.
ChEMBL_643523 (CHEMBL1212387)
IC50
0.7±n/a nM
Citation
 Hortala, LRinaldi-Carmona, MCongy, CBoulu, LSadoun, FFabre, GFinance, OBarth, F Rational design of a novel peripherally-restricted, orally active CB(1) cannabinoid antagonist containing a 2,3-diarylpyrrole motif. Bioorg Med Chem Lett 20:4573-7 (2010)  
Target
Name:
Cannabinoid receptor 1
Synonyms:
Brain-type cannabinoid receptor CB-R CNR1_RAT Cannabinoid receptor Cnr1 | Skr6
Type:
G Protein-Coupled Receptor (GPCR)
Mol. Mass.:
52856.55
Organism:
Rattus norvegicus (rat)
Description:
P20272
Residue:
473
  
Inhibitor
Name:
BDBM50323007
Synonyms:
1-(5-(4-chlorophenyl)-4-(2,4-dichlorophenyl)-1-methyl-1H-pyrrole-2-carbonyl)-4-phenylpiperidine-4-carboxamide | CHEMBL1210700
Type:
Small organic molecule
Emp. Form.:
C30H26Cl3N3O2
Mol. Mass.:
566.905
SMILES:
Cn1c(cc(c1-c1ccc(Cl)cc1)-c1ccc(Cl)cc1Cl)C(=O)N1CCC(CC1)(C(N)=O)c1ccccc1
: