Target
Fatty-acid amide hydrolase 1
Ligand
BDBM50323043
Substrate
Meas. Tech.
ChEMBL_643589 (CHEMBL1212453)
IC50
112±n/a nM
Citation
 Gattinoni, SSimone, CDDallavalle, SFezza, FNannei, RBattista, NMinetti, PQuattrociocchi, GCaprioli, ABorsini, FCabri, WPenco, SMerlini, LMaccarrone, M A new group of oxime carbamates as reversible inhibitors of fatty acid amide hydrolase. Bioorg Med Chem Lett 20:4406-11 (2010)  
Target
Name:
Fatty-acid amide hydrolase 1
Synonyms:
Anandamide amidohydrolase FAAH1_MOUSE Faah1 Fatty-acid amide hydrolase (FAAH) Oleamide hydrolase 1
Type:
Hydrolase; single-pass membrane protein; homodimer
Mol. Mass.:
63227.28
Organism:
Mus musculus (mouse)
Description:
Mouse brain membranes were used in the assay.
Residue:
579
  
Inhibitor
Name:
BDBM50323043
Synonyms:
1-(3-Thiophen-2-yl-phenyl)-ethanone, O-(1-piperidinocarbonyl)oxime | CHEMBL1210156
Type:
Small organic molecule
Emp. Form.:
C18H20N2O2S
Mol. Mass.:
328.429
SMILES:
CC(=NOC(=O)N1CCCCC1)c1cccc(c1)-c1cccs1
: